Target
Glycogen synthase kinase-3 beta
Ligand
BDBM50133061
Substrate
Meas. Tech.
ChEMBL_71153 (CHEMBL684979)
IC50
26±n/a nM
Citation
 Kuo, GHProuty, CDeAngelis, AShen, LO'Neill, DJShah, CConnolly, PJMurray, WVConway, BRCheung, PWestover, LXu, JZLook, RADemarest, KTEmanuel, SMiddleton, SAJolliffe, LBeavers, MPChen, X Synthesis and discovery of macrocyclic polyoxygenated bis-7-azaindolylmaleimides as a novel series of potent and highly selective glycogen synthase kinase-3beta inhibitors. J Med Chem 46:4021-31 (2003)  
Target
Name:
Glycogen synthase kinase-3 beta
Synonyms:
GSK-3 beta GSK3B Glycogen synthase kinase 3 beta (GSK3B) Glycogen synthase kinase-3 beta (GSK-3B) Glycogen synthase kinase-3 beta (GSK3B) Glycogen synthase kinase-3beta (GSK3B) | Serine/threonine-protein kinase GSK3B
Type:
Enzyme
Mol. Mass.:
46756.38
Organism:
Homo sapiens (Human)
Description:
P49841
Residue:
420
  
Inhibitor
Name:
BDBM50133061
Synonyms:
17,20,23,26-tetraoxa-4,14,29-triazahexacyclo[27.6.1.17,14.02,6.08,13.030,35]heptatriaconta-1(36),2(6),7(37),8,10,12,30,32,34-nonaene-3,5-dione | CHEMBL336179
Type:
Small organic molecule
Emp. Form.:
C30H31N3O6
Mol. Mass.:
529.5836
SMILES:
O=C1NC(=O)C2=C1c1cn(CCOCCOCCOCCOCCn3cc2c2ccccc32)c2ccccc12
: