Target
Glycogen synthase kinase-3 beta
Ligand
BDBM50133067
Substrate
Meas. Tech.
ChEMBL_71153 (CHEMBL684979)
IC50
138±n/a nM
Citation
 Kuo, GHProuty, CDeAngelis, AShen, LO'Neill, DJShah, CConnolly, PJMurray, WVConway, BRCheung, PWestover, LXu, JZLook, RADemarest, KTEmanuel, SMiddleton, SAJolliffe, LBeavers, MPChen, X Synthesis and discovery of macrocyclic polyoxygenated bis-7-azaindolylmaleimides as a novel series of potent and highly selective glycogen synthase kinase-3beta inhibitors. J Med Chem 46:4021-31 (2003)  
Target
Name:
Glycogen synthase kinase-3 beta
Synonyms:
GSK-3 beta GSK3B Glycogen synthase kinase 3 beta (GSK3B) Glycogen synthase kinase-3 beta (GSK-3B) Glycogen synthase kinase-3 beta (GSK3B) Glycogen synthase kinase-3beta (GSK3B) | Serine/threonine-protein kinase GSK3B
Type:
Enzyme
Mol. Mass.:
46756.38
Organism:
Homo sapiens (Human)
Description:
P49841
Residue:
420
  
Inhibitor
Name:
BDBM50133067
Synonyms:
17,20-dioxa-4,12,14,23-tetraazahexacyclo[21.6.1.17,14.02,6.08,13.024,29]hentriaconta-1(30),2(6),7(31),8,10,12,24,26,28-nonaene-3,5-dione | CHEMBL334555
Type:
Small organic molecule
Emp. Form.:
C25H22N4O4
Mol. Mass.:
442.4666
SMILES:
O=C1NC(=O)C2=C1c1cn(CCOCCOCCn3cc2c2cccnc32)c2ccccc12
: