Target
Protein kinase C gamma type
Ligand
BDBM50133063
Substrate
Meas. Tech.
ChEMBL_161149 (CHEMBL767417)
IC50
2730±n/a nM
Citation
 Kuo, GHProuty, CDeAngelis, AShen, LO'Neill, DJShah, CConnolly, PJMurray, WVConway, BRCheung, PWestover, LXu, JZLook, RADemarest, KTEmanuel, SMiddleton, SAJolliffe, LBeavers, MPChen, X Synthesis and discovery of macrocyclic polyoxygenated bis-7-azaindolylmaleimides as a novel series of potent and highly selective glycogen synthase kinase-3beta inhibitors. J Med Chem 46:4021-31 (2003)  
Target
Name:
Protein kinase C gamma type
Synonyms:
KPCG_HUMAN PKC-gamma PRKCG Protein kinase C gamma type Protein kinase C, gamma
Type:
Enzyme
Mol. Mass.:
78458.05
Organism:
Homo sapiens (Human)
Description:
The recombinant human PKC enzymes were produced using a baculovirus expression system in SF9 cells
Residue:
697
  
Inhibitor
Name:
BDBM50133063
Synonyms:
17,20-dioxa-4,14,23-triazahexacyclo[21.6.1.17,14.02,6.08,13.024,29]hentriaconta-1(30),2(6),7(31),8,10,12,24,26,28-nonaene-3,5-dione | CHEMBL131035
Type:
Small organic molecule
Emp. Form.:
C26H23N3O4
Mol. Mass.:
441.4785
SMILES:
O=C1NC(=O)C2=C1c1cn(CCOCCOCCn3cc2c2ccccc32)c2ccccc12
: