Target
D(2) dopamine receptor
Ligand
BDBM50122824
Substrate
Meas. Tech.
ChEMBL_62077 (CHEMBL672376)
Ki
2300±n/a nM
Citation
 Balle, TPerregaard, JRamirez, MTLarsen, AKSøby, KKLiljefors, TAndersen, K Synthesis and structure-affinity relationship investigations of 5-heteroaryl-substituted analogues of the antipsychotic sertindole. A new class of highly selective alpha(1) adrenoceptor antagonists. J Med Chem 46:265-83 (2003)  
Target
Name:
D(2) dopamine receptor
Synonyms:
DOPAMINE D2 DOPAMINE D2 Short Dopamine D2 receptor Drd2
Type:
G Protein-Coupled Receptor (GPCR)
Mol. Mass.:
50931.60
Organism:
Rattus norvegicus (rat)
Description:
P61169
Residue:
444
  
Inhibitor
Name:
BDBM50122824
Synonyms:
3-(2-{4-[1-(4-Fluoro-phenyl)-5-(1-methyl-1H-[1,2,4]triazol-3-yl)-1H-indol-3-yl]-piperidin-1-yl}-ethyl)-oxazolidin-2-one | CHEMBL313424
Type:
Small organic molecule
Emp. Form.:
C27H29FN6O2
Mol. Mass.:
488.5566
SMILES:
Cn1cnc(n1)-c1ccc2n(cc(C3CCN(CCN4CCOC4=O)CC3)c2c1)-c1ccc(F)cc1
: