Target
D(3) dopamine receptor
Ligand
BDBM50133931
Substrate
Meas. Tech.
ChEMBL_62281 (CHEMBL675051)
Ki
11±n/a nM
Citation
 Varady, JWu, XFang, XMin, JHu, ZLevant, BWang, S Molecular modeling of the three-dimensional structure of dopamine 3 (D3) subtype receptor: discovery of novel and potent D3 ligands through a hybrid pharmacophore- and structure-based database searching approach. J Med Chem 46:4377-92 (2003)  
Target
Name:
D(3) dopamine receptor
Synonyms:
DOPAMINE D3 DRD3_HUMAN Dopamine D3 receptor (D3) Dopamine receptor Dopamine receptor D3
Type:
Mol. Mass.:
44243.43
Organism:
Homo sapiens (Human)
Description:
Residue:
400
  
Inhibitor
Name:
BDBM50133931
Synonyms:
1-(4-fluoro-phenyl)-4-(3,4,6,7,12,12a-hexahydro-1H-pyrazino[1',2':1,6]pyrido[3,4-b]indol-2-yl)-butan-1-one CHEMBL136711
Type:
Small organic molecule
Emp. Form.:
C24H26FN3O
Mol. Mass.:
391.4811
SMILES:
Fc1ccc(cc1)C(=O)CCCN1CCN2Cc3[nH]c4ccccc4c3CC2C1
: