Target
Solute carrier family 15 member 1
Ligand
BDBM50137036
Substrate
Meas. Tech.
ChEMBL_89213 (CHEMBL699705)
Ki
60000±n/a nM
Citation
 Gebauer, SKnütter, IHartrodt, BBrandsch, MNeubert, KThondorf, I Three-dimensional quantitative structure-activity relationship analyses of peptide substrates of the mammalian H+/peptide cotransporter PEPT1. J Med Chem 46:5725-34 (2003)  
Target
Name:
Solute carrier family 15 member 1
Synonyms:
Intestinal H(+)/peptide cotransporter Oligopeptide transporter, small intestine isoform Peptide transporter 1 SLC15A1
Type:
PROTEIN
Mol. Mass.:
78818.07
Organism:
Homo sapiens (Human)
Description:
ChEMBL_1488839
Residue:
708
  
Inhibitor
Name:
BDBM50137036
Synonyms:
1-(2-ammoniopropanoyl)piperidine-2-carboxylate | CHEMBL153940
Type:
Small organic molecule
Emp. Form.:
C9H16N2O3
Mol. Mass.:
200.2349
SMILES:
CC([NH3+])C(=O)N1CCCCC1C([O-])=O
: