Target
Nitric oxide synthase, brain
Ligand
BDBM50124521
Substrate
Meas. Tech.
ChEMBL_143359 (CHEMBL751653)
IC50
40000±n/a nM
Citation
 Tinker, ACBeaton, HGBoughton-Smith, NCook, TRCooper, SLFraser-Rae, LHallam, KHamley, PMcInally, TNicholls, DJPimm, ADWallace, AV 1,2-Dihydro-4-quinazolinamines: potent, highly selective inhibitors of inducible nitric oxide synthase which show antiinflammatory activity in vivo. J Med Chem 46:913-6 (2003)  
Target
Name:
Nitric oxide synthase, brain
Synonyms:
Constitutive NOS NC-NOS NOS type I nNOS NOS1_HUMAN Neuronal nitric oxide synthase Nitric oxide synthase, neuronal (nNOS) bNOS | nNOS
Type:
Homodimer
Mol. Mass.:
160985.98
Organism:
Homo sapiens (Human)
Description:
P29475
Residue:
1434
  
Inhibitor
Name:
BDBM50124521
Synonyms:
CHEMBL174290 | ethyl 4'-amino-5'-fluorospiro[hexahydropyridine-4,2'-(1',2'-dihydroquinazoline)]-1-carboxylate
Type:
Small organic molecule
Emp. Form.:
C15H19FN4O2
Mol. Mass.:
306.3354
SMILES:
CCOC(=O)N1CCC2(CC1)Nc1cccc(F)c1C(N)=N2
: