Target
Nitric oxide synthase, inducible
Ligand
BDBM50124525
Substrate
Meas. Tech.
ChEMBL_89194 (CHEMBL701146)
IC50
67±n/a nM
Citation
 Tinker, ACBeaton, HGBoughton-Smith, NCook, TRCooper, SLFraser-Rae, LHallam, KHamley, PMcInally, TNicholls, DJPimm, ADWallace, AV 1,2-Dihydro-4-quinazolinamines: potent, highly selective inhibitors of inducible nitric oxide synthase which show antiinflammatory activity in vivo. J Med Chem 46:913-6 (2003)  
Target
Name:
Nitric oxide synthase, inducible
Synonyms:
HEP-NOS Inducible NO synthase NOS type II NOS2A Nitric oxide synthase, inducible (iNOS) | iNOS
Type:
Homodimer
Mol. Mass.:
131141.95
Organism:
Homo sapiens (Human)
Description:
P35228
Residue:
1153
  
Inhibitor
Name:
BDBM50124525
Synonyms:
4'-amino-5'-fluorospiro[hexahydropyridine-4,2'-(1',2'-dihydroquinazoline)]-1-yl-3-thienylmethanone CHEMBL170580
Type:
Small organic molecule
Emp. Form.:
C17H17FN4OS
Mol. Mass.:
344.406
SMILES:
NC1=NC2(CCN(CC2)C(=O)c2ccsc2)Nc2cccc(F)c12
: