Target
Nitric oxide synthase, inducible
Ligand
BDBM50098937
Substrate
Meas. Tech.
ChEMBL_89194 (CHEMBL701146)
IC50
14000±n/a nM
Citation
 Tinker, ACBeaton, HGBoughton-Smith, NCook, TRCooper, SLFraser-Rae, LHallam, KHamley, PMcInally, TNicholls, DJPimm, ADWallace, AV 1,2-Dihydro-4-quinazolinamines: potent, highly selective inhibitors of inducible nitric oxide synthase which show antiinflammatory activity in vivo. J Med Chem 46:913-6 (2003)  
Target
Name:
Nitric oxide synthase, inducible
Synonyms:
HEP-NOS Inducible NO synthase NOS type II NOS2A Nitric oxide synthase, inducible (iNOS) | iNOS
Type:
Homodimer
Mol. Mass.:
131141.95
Organism:
Homo sapiens (Human)
Description:
P35228
Residue:
1153
  
Inhibitor
Name:
BDBM50098937
Synonyms:
(S)-methyl 2-amino-5-(amino(nitroamino)methyleneamino)pentanoate CHEMBL7890 N(gamma)-Nitro-L-arginine methyl ester N-omega-nitro-L-arginine methyl ester methyl (2S)-2-amino-5-{[(Z)-imino(nitroamino)methyl]amino}pentanoate | nitro-L-arginine methyl ester
Type:
Small organic molecule
Emp. Form.:
C7H15N5O4
Mol. Mass.:
233.2251
SMILES:
COC(=O)[C@@H](N)CCCNC(N)=N[N+]([O-])=O
: