Target
Nitric oxide synthase, brain
Ligand
BDBM50124525
Substrate
Meas. Tech.
ChEMBL_143359 (CHEMBL751653)
IC50
70000±n/a nM
Citation
 Tinker, ACBeaton, HGBoughton-Smith, NCook, TRCooper, SLFraser-Rae, LHallam, KHamley, PMcInally, TNicholls, DJPimm, ADWallace, AV 1,2-Dihydro-4-quinazolinamines: potent, highly selective inhibitors of inducible nitric oxide synthase which show antiinflammatory activity in vivo. J Med Chem 46:913-6 (2003)  
Target
Name:
Nitric oxide synthase, brain
Synonyms:
Constitutive NOS NC-NOS NOS type I nNOS NOS1_HUMAN Neuronal nitric oxide synthase Nitric oxide synthase, neuronal (nNOS) bNOS | nNOS
Type:
Homodimer
Mol. Mass.:
160985.98
Organism:
Homo sapiens (Human)
Description:
P29475
Residue:
1434
  
Inhibitor
Name:
BDBM50124525
Synonyms:
4'-amino-5'-fluorospiro[hexahydropyridine-4,2'-(1',2'-dihydroquinazoline)]-1-yl-3-thienylmethanone CHEMBL170580
Type:
Small organic molecule
Emp. Form.:
C17H17FN4OS
Mol. Mass.:
344.406
SMILES:
NC1=NC2(CCN(CC2)C(=O)c2ccsc2)Nc2cccc(F)c12
: