Target
Nitric oxide synthase, endothelial
Ligand
BDBM50207159
Substrate
Meas. Tech.
ChEMBL_65297 (CHEMBL873599)
IC50
100000±n/a nM
Citation
 Tinker, ACBeaton, HGBoughton-Smith, NCook, TRCooper, SLFraser-Rae, LHallam, KHamley, PMcInally, TNicholls, DJPimm, ADWallace, AV 1,2-Dihydro-4-quinazolinamines: potent, highly selective inhibitors of inducible nitric oxide synthase which show antiinflammatory activity in vivo. J Med Chem 46:913-6 (2003)  
Target
Name:
Nitric oxide synthase, endothelial
Synonyms:
Constitutive NOS Endothelial NOS NOS type III NOS3_HUMAN Nitric oxide synthase (inducible and endothelial) Nitric-oxide synthase (endothelial and brain) eNOS
Type:
Enzyme Catalytic Domain
Mol. Mass.:
133297.84
Organism:
Homo sapiens (Human)
Description:
P29474
Residue:
1203
  
Inhibitor
Name:
BDBM50207159
Synonyms:
2-aminoguanidine AMINOGUANIDINE Guanyl hydrazine Monoaminoguanidine | hydrazinecarboximidamide
Type:
Small organic molecule
Emp. Form.:
CH6N4
Mol. Mass.:
74.0851
SMILES:
NNC(N)=N
: