Target
Nitric oxide synthase, inducible
Ligand
BDBM50207159
Substrate
Meas. Tech.
ChEMBL_89194 (CHEMBL701146)
IC50
3900±n/a nM
Citation
 Tinker, ACBeaton, HGBoughton-Smith, NCook, TRCooper, SLFraser-Rae, LHallam, KHamley, PMcInally, TNicholls, DJPimm, ADWallace, AV 1,2-Dihydro-4-quinazolinamines: potent, highly selective inhibitors of inducible nitric oxide synthase which show antiinflammatory activity in vivo. J Med Chem 46:913-6 (2003)  
Target
Name:
Nitric oxide synthase, inducible
Synonyms:
HEP-NOS Inducible NO synthase NOS type II NOS2A Nitric oxide synthase, inducible (iNOS) | iNOS
Type:
Homodimer
Mol. Mass.:
131141.95
Organism:
Homo sapiens (Human)
Description:
P35228
Residue:
1153
  
Inhibitor
Name:
BDBM50207159
Synonyms:
2-aminoguanidine AMINOGUANIDINE Guanyl hydrazine Monoaminoguanidine | hydrazinecarboximidamide
Type:
Small organic molecule
Emp. Form.:
CH6N4
Mol. Mass.:
74.0851
SMILES:
NNC(N)=N
: