Target
Nitric oxide synthase, inducible
Ligand
BDBM50124541
Substrate
Meas. Tech.
ChEMBL_89194 (CHEMBL701146)
IC50
32000±n/a nM
Citation
 Tinker, ACBeaton, HGBoughton-Smith, NCook, TRCooper, SLFraser-Rae, LHallam, KHamley, PMcInally, TNicholls, DJPimm, ADWallace, AV 1,2-Dihydro-4-quinazolinamines: potent, highly selective inhibitors of inducible nitric oxide synthase which show antiinflammatory activity in vivo. J Med Chem 46:913-6 (2003)  
Target
Name:
Nitric oxide synthase, inducible
Synonyms:
HEP-NOS Inducible NO synthase NOS type II NOS2A Nitric oxide synthase, inducible (iNOS) | iNOS
Type:
Homodimer
Mol. Mass.:
131141.95
Organism:
Homo sapiens (Human)
Description:
P35228
Residue:
1153
  
Inhibitor
Name:
BDBM50124541
Synonyms:
2-Ethyl-2-methyl-1,2-dihydro-quinazolin-4-ylamine CHEMBL354899
Type:
Small organic molecule
Emp. Form.:
C11H15N3
Mol. Mass.:
189.2569
SMILES:
CCC1(C)Nc2ccccc2C(N)=N1
: