Target
Kappa-type opioid receptor
Ligand
BDBM50027103
Substrate
Meas. Tech.
ChEMBL_147243 (CHEMBL755511)
EC50
98±n/a nM
Citation
 Grundt, PJales, ARTraynor, JRLewis, JWHusbands, SM 14-amino, 14-alkylamino, and 14-acylamino analogs of oxymorphindole. Differential effects on opioid receptor binding and functional profiles. J Med Chem 46:1563-6 (2003)  
Target
Name:
Kappa-type opioid receptor
Synonyms:
K-OR-1 Kappa-opioid receptor (KOR) Kappa-type opioid receptor (KOR) OPIATE Kappa OPRK1 kappa opioid receptor (KOR)
Type:
G Protein-Coupled Receptor (GPCR)
Mol. Mass.:
42648.76
Organism:
Homo sapiens (Human)
Description:
P41145
Residue:
380
  
Inhibitor
Name:
BDBM50027103
Synonyms:
CHEMBL2113383
Type:
Small organic molecule
Emp. Form.:
C25H27N3O2
Mol. Mass.:
401.5008
SMILES:
[H][C@@]12Oc3c4c(CC5N(C)CC[C@@]14[C@]5(Cc1c2[nH]c2ccccc12)NCC)ccc3O
: