Target
Delta-type opioid receptor
Ligand
BDBM50027103
Substrate
Meas. Tech.
ChEMBL_145466 (CHEMBL751253)
Ki
0.730000±n/a nM
Citation
 Grundt, PJales, ARTraynor, JRLewis, JWHusbands, SM 14-amino, 14-alkylamino, and 14-acylamino analogs of oxymorphindole. Differential effects on opioid receptor binding and functional profiles. J Med Chem 46:1563-6 (2003)  
Target
Name:
Delta-type opioid receptor
Synonyms:
D-OR-1 Delta opioid receptor OPIATE Delta OPRD1 OPRK1 | opioid receptor, delta 1
Type:
G Protein-Coupled Receptor (GPCR)
Mol. Mass.:
40382.98
Organism:
Homo sapiens (Human)
Description:
Competition binding assays were carried out using membrane preparations from transfected HN9.10 cells that constitutively expressed the delta opioid receptor.
Residue:
372
  
Inhibitor
Name:
BDBM50027103
Synonyms:
CHEMBL2113383
Type:
Small organic molecule
Emp. Form.:
C25H27N3O2
Mol. Mass.:
401.5008
SMILES:
[H][C@@]12Oc3c4c(CC5N(C)CC[C@@]14[C@]5(Cc1c2[nH]c2ccccc12)NCC)ccc3O
: