Target
Carbonic anhydrase 2
Ligand
BDBM50146756
Substrate
Meas. Tech.
ChEMBL_45042 (CHEMBL658040)
Ki
8±n/a nM
Citation
 de Leval, XIlies, MCasini, ADogné, JMScozzafava, AMasini, EMincione, FStarnotti, MSupuran, CT Carbonic anhydrase inhibitors: synthesis and topical intraocular pressure lowering effects of fluorine-containing inhibitors devoid of enhanced reactivity. J Med Chem 47:2796-804 (2004)  
Target
Name:
Carbonic anhydrase 2
Synonyms:
CA-II CAC Carbonate dehydratase II Carbonic anhydrase 2 (CA-II) Carbonic anhydrase C Carbonic anhydrase II (CA-II) Carbonic anhydrase II (hCA II) | Carbonic anhydrase isoenzyme II (hCA II)
Type:
Enzyme
Mol. Mass.:
29250.71
Organism:
Homo sapiens (Human)
Description:
P00918
Residue:
260
  
Inhibitor
Name:
BDBM50146756
Synonyms:
4-(3-Pentafluorophenyl-ureido)-benzenesulfonamide | CHEMBL316779
Type:
Small organic molecule
Emp. Form.:
C13H8F5N3O3S
Mol. Mass.:
381.278
SMILES:
NS(=O)(=O)c1ccc(NC(=O)Nc2c(F)c(F)c(F)c(F)c2F)cc1
: