Target
Cyclin-dependent kinase 1/G2/mitotic-specific cyclin-B1/G2/mitotic-specific cyclin-B2/G2/mitotic-specific cyclin-B3
Ligand
BDBM50148064
Substrate
Meas. Tech.
ChEMBL_50338 (CHEMBL660807)
IC50
>100000±n/a nM
Citation
 Guengerich, FPSorrells, JLSchmitt, SKrauser, JAAryal, PMeijer, L Generation of new protein kinase inhibitors utilizing cytochrome p450 mutant enzymes for indigoid synthesis. J Med Chem 47:3236-41 (2004)  
Target
Name:
Cyclin-dependent kinase 1/G2/mitotic-specific cyclin-B1/G2/mitotic-specific cyclin-B2/G2/mitotic-specific cyclin-B3
Synonyms:
Cyclin B/Cyclin-Dependent Kinase 1 (CDK1)/G2/mitotic-specific cyclin B2/G2/mitotic-specific cyclin B3 Cyclin-dependent kinase 1/cyclin B
Type:
Mol. Mass.:
Description:
ASSAY_ID of EBI is 40085
Components:
This complex has 4 components.
Component 1
Name:
G2/mitotic-specific cyclin-B3
Synonyms:
CCNB3 CYCB3 G2/mitotic-specific cyclin-B3
Type:
PROTEIN
Mol. Mass.:
157916.84
Organism:
Homo sapiens (Human)
Description:
Residue:
1395
  
Component 2
Name:
G2/mitotic-specific cyclin-B1
Synonyms:
CCNB CCNB1_HUMAN
Type:
Enzyme Subunit
Mol. Mass.:
48340.95
Organism:
Homo sapiens (Human)
Description:
P14635
Residue:
433
  
Component 3
Name:
G2/mitotic-specific cyclin-B2
Synonyms:
CCNB2 Cyclin-dependent kinase 1/cyclin B | G2/mitotic-specific cyclin-B2
Type:
PROTEIN
Mol. Mass.:
45293.13
Organism:
Homo sapiens (Human)
Description:
Residue:
398
  
Component 4
Name:
Cyclin-dependent kinase 1
Synonyms:
CDC2 CDK1 CDKN1 Cell division protein kinase 1 P34CDC2 | p34 protein kinase
Type:
Enzyme Subunit
Mol. Mass.:
34101.08
Organism:
Homo sapiens (Human)
Description:
P06493
Residue:
297
  
Inhibitor
Name:
BDBM50148064
Synonyms:
5-Methoxy-1H,1'H-[2,2']biindolylidene-3,3'-dione | CHEMBL109622
Type:
Small organic molecule
Emp. Form.:
C17H12N2O3
Mol. Mass.:
292.2888
SMILES:
COc1ccc2N=C(C(=O)c2c1)c1[nH]c2ccccc2c1O
: