Target
Cyclin-dependent kinase 5 activator 1
Ligand
BDBM50148064
Substrate
Meas. Tech.
ChEMBL_51326 (CHEMBL663605)
IC50
>100000±n/a nM
Citation
 Guengerich, FPSorrells, JLSchmitt, SKrauser, JAAryal, PMeijer, L Generation of new protein kinase inhibitors utilizing cytochrome p450 mutant enzymes for indigoid synthesis. J Med Chem 47:3236-41 (2004)  
Target
Name:
Cyclin-dependent kinase 5 activator 1
Synonyms:
CDK5/p35 Cyclin-dependent kinase 5 regulatory subunit 1 | Cyclin-dependent kinase 5/CDK5 activator 1
Type:
Protein Complex
Mol. Mass.:
Description:
Components:
This complex has 2 components.
Component 1
Name:
Cyclin-dependent kinase 5
Synonyms:
CDK5 CDKN5 Cyclin-dependent kinase 5 (CDK5/ p25) Cyclin-dependent-like kinase 5 PSSALRE Tau protein kinase II catalytic subunit
Type:
Enzyme Subunit
Mol. Mass.:
33308.61
Organism:
Homo sapiens (Human)
Description:
Residue:
292
  
Component 2
Name:
Cyclin-dependent kinase 5 activator 1
Synonyms:
CD5R1_HUMAN CDK5R1 Cyclin-dependent kinase 5 (CDK5/p25) NCK5A p35
Type:
Enzyme Subunit
Mol. Mass.:
34077.43
Organism:
Homo sapiens (Human)
Description:
Q15078
Residue:
307
  
Inhibitor
Name:
BDBM50148064
Synonyms:
5-Methoxy-1H,1'H-[2,2']biindolylidene-3,3'-dione | CHEMBL109622
Type:
Small organic molecule
Emp. Form.:
C17H12N2O3
Mol. Mass.:
292.2888
SMILES:
COc1ccc2N=C(C(=O)c2c1)c1[nH]c2ccccc2c1O
: