Target
Dimer of Protein farnesyltransferase subunit beta
Ligand
BDBM50051826
Substrate
Meas. Tech.
ChEMBL_70572 (CHEMBL682705)
IC50
1±n/a nM
Citation
 Bell, IM Inhibitors of farnesyltransferase: a rational approach to cancer chemotherapy? J Med Chem 47:1869-78 (2004)  
Target
Name:
Dimer of Protein farnesyltransferase subunit beta
Synonyms:
Protein Farnesyltransferase (PFT) Chain B
Type:
Mol. Mass.:
Description:
ASSAY_ID of EBI is 51428
Components:
This complex has 3 components.
Component 1
Name:
Protein farnesyltransferase subunit beta
Synonyms:
CAAX farnesyltransferase subunit alpha FNTB FTase-alpha GGTase-I-alpha Protein farnesyl/geranylgeranyl transferase Protein farnesyltransferase subunit beta Protein farnesyltransferase/geranylgeranyltransferase type-1 subunit alpha Ras proteins prenyltransferase subunit beta | Type I protein geranyl-geranyltransferase subunit alpha
Type:
Enzyme Subunit
Mol. Mass.:
48766.02
Organism:
Homo sapiens (Human)
Description:
Protein farnesyltransferase subunit beta
Residue:
437
  
Component 2
Name:
Protein farnesyltransferase subunit beta
Synonyms:
CAAX farnesyltransferase subunit alpha FNTB FTase-alpha GGTase-I-alpha Protein farnesyl/geranylgeranyl transferase Protein farnesyltransferase subunit beta Protein farnesyltransferase/geranylgeranyltransferase type-1 subunit alpha Ras proteins prenyltransferase subunit beta | Type I protein geranyl-geranyltransferase subunit alpha
Type:
Enzyme Subunit
Mol. Mass.:
48766.02
Organism:
Homo sapiens (Human)
Description:
Protein farnesyltransferase subunit beta
Residue:
437
  
Inhibitor
Name:
BDBM50051826
Synonyms:
CHEMBL27486 [4-((R)-2-Amino-3-mercapto-propyl)-3-butyl-piperazin-1-yl]-naphthalen-1-yl-methanone
Type:
Small organic molecule
Emp. Form.:
C22H31N3OS
Mol. Mass.:
385.566
SMILES:
CCCC[C@H]1CN(CCN1C[C@@H](N)CS)C(=O)c1cccc2ccccc12
: