Target
Vasopressin V2 receptor
Ligand
BDBM50370392
Substrate
Meas. Tech.
ChEMBL_215012 (CHEMBL818810)
IC50
100±n/a nM
Citation
 Itzhak, YKalir, AWeissman, BACohen, S New analgesic drugs derived from phencyclidine. J Med Chem 24:496-9 (1981)  
Target
Name:
Vasopressin V2 receptor
Synonyms:
AVPR V2 Avpr2 V2R_RAT Vasopressin receptor
Type:
G-protein coupled receptor
Mol. Mass.:
40761.85
Organism:
Rattus norvegicus (Rat)
Description:
Residue:
371
  
Inhibitor
Name:
BDBM50370392
Synonyms:
CHEMBL369712
Type:
Small organic molecule
Emp. Form.:
C25H27N3O2S
Mol. Mass.:
433.566
SMILES:
CN(C)C1CCCN(C(=O)c2ccc(NC(=O)c3ccccc3C)cc2)c2ccsc12
: