Target
Sterol O-acyltransferase 1
Ligand
BDBM50028867
Substrate
Meas. Tech.
ChEMBL_28651 (CHEMBL643830)
IC50
18000±n/a nM
Citation
 Itzhak, YKalir, AWeissman, BACohen, S New analgesic drugs derived from phencyclidine. J Med Chem 24:496-9 (1981)  
Target
Name:
Sterol O-acyltransferase 1
Synonyms:
ACACT ACAT Acetyl-CoA acetyltransferase, mitochondrial Acyl-CoA: cholesterol acyltransferase (ACAT) Cholesterol acyltransferase 1 SOAT1 STAT
Type:
Multi-pass membrane protein may form homo- or heterodimers.
Mol. Mass.:
64751.94
Organism:
Homo sapiens (Human)
Description:
P35610
Residue:
550
  
Inhibitor
Name:
BDBM50028867
Synonyms:
(3R,4S)-1,4-Bis-(4-methoxy-phenyl)-3-(3-phenyl-propyl)-azetidin-2-one SCH-47949 | SCH-48461
Type:
Small organic molecule
Emp. Form.:
C26H27NO3
Mol. Mass.:
401.4975
SMILES:
COc1ccc(cc1)[C@@H]1[C@@H](CCCc2ccccc2)C(=O)N1c1ccc(OC)cc1
: