Target
Vasopressin V2 receptor
Ligand
BDBM50370399
Substrate
Meas. Tech.
ChEMBL_214715 (CHEMBL815213)
IC50
>10000±n/a nM
Citation
 Itzhak, YKalir, AWeissman, BACohen, S New analgesic drugs derived from phencyclidine. J Med Chem 24:496-9 (1981)  
Target
Name:
Vasopressin V2 receptor
Synonyms:
ADHR AVPR2 DIR Renal-type arginine vasopressin receptor V2R_HUMAN Vasopressin V2 receptor | Vasopressin receptor
Type:
Receptor
Mol. Mass.:
40295.28
Organism:
Homo sapiens (Human)
Description:
P30518
Residue:
371
  
Inhibitor
Name:
BDBM50370399
Synonyms:
CHEMBL360272
Type:
Small organic molecule
Emp. Form.:
C23H22N2O2S
Mol. Mass.:
390.498
SMILES:
Cc1ccccc1C(=O)Nc1ccc(cc1)C(=O)N1CCCCc2sccc12
: