Target
Prostaglandin D2 receptor
Ligand
BDBM17638
Substrate
Meas. Tech.
ChEMBL_302469 (CHEMBL826334)
Ki
>10000±n/a nM
Citation
 Torisu, KKobayashi, KIwahashi, MEgashira, HNakai, YOkada, YNanbu, FOhuchida, SNakai, HToda, M Discovery of new chemical leads for prostaglandin D2 receptor antagonists. Bioorg Med Chem Lett 14:4557-62 (2004)  
Target
Name:
Prostaglandin D2 receptor
Synonyms:
PD2R_MOUSE Ptgdr
Type:
PROTEIN
Mol. Mass.:
40018.63
Organism:
Mus musculus
Description:
ChEMBL_788408
Residue:
357
  
Inhibitor
Name:
BDBM17638
Synonyms:
2-{1-[(4-chlorophenyl)carbonyl]-5-methoxy-2-methyl-1H-indol-3-yl}acetic acid Indocin US11478464, Compound Indomethacin US9271961, Indomethacin | indometacin
Type:
Small organic molecule
Emp. Form.:
C19H16ClNO4
Mol. Mass.:
357.788
SMILES:
COc1ccc2n(C(=O)c3ccc(Cl)cc3)c(C)c(CC(O)=O)c2c1
: