Target
Potassium voltage-gated channel subfamily H member 2
Ligand
BDBM50151860
Substrate
Meas. Tech.
ChEMBL_304914 (CHEMBL827807)
IC50
100000±n/a nM
Citation
 Du, LPTsai, KCLi, MYYou, QDXia, L The pharmacophore hypotheses of I(Kr) potassium channel blockers: novel class III antiarrhythmic agents. Bioorg Med Chem Lett 14:4771-7 (2004)  
Target
Name:
Potassium voltage-gated channel subfamily H member 2
Synonyms:
1,3-beta-glucan synthase component GLS2 ERG Eag-related protein 1 Ether-a-go-go-related gene (HERG) Ether-a-go-go-related gene potassium channel 1 Ether-a-go-go-related gene potassium channel 1 (hERG1) Ether-a-go-go-related protein 1 H-ERG KCNH2 Potassium voltage-gated channel subfamily H member 2 (hERG) Voltage-gated potassium channel subunit Kv11.1 hERG Potassium Channel 1 | putative potassium channel subunit
Type:
Multi-pass membrane protein
Mol. Mass.:
126672.65
Organism:
Homo sapiens (Human)
Description:
Q12809
Residue:
1159
  
Inhibitor
Name:
BDBM50151860
Synonyms:
4-Acetylamino-N-(2-diethylamino-ethyl)-benzamide CHEMBL1097 N-acetylprocainamide
Type:
Small organic molecule
Emp. Form.:
C15H23N3O2
Mol. Mass.:
277.362
SMILES:
CCN(CC)CCNC(=O)c1ccc(NC(C)=O)cc1
: