Target
Carbonic anhydrase 1
Ligand
BDBM26989
Substrate
Meas. Tech.
ChEMBL_302781 (CHEMBL838843)
Ki
8400000±n/a nM
Citation
 Innocenti, ALehtonen, JMParkkila, SScozzafava, ASupuran, CT Carbonic anhydrase inhibitors. Inhibition of the newly isolated murine isozyme XIII with anions. Bioorg Med Chem Lett 14:5435-9 (2004)  
Target
Name:
Carbonic anhydrase 1
Synonyms:
CA-I CAB Carbonate dehydratase I Carbonic anhydrase 1 (CA I) Carbonic anhydrase 1 (Recombinant CA I) Carbonic anhydrase B Carbonic anhydrase I (CA I) Carbonic anhydrase I (CAI) Carbonic anhydrase isoenzyme I (hCA I) | hCA
Type:
Enzyme
Mol. Mass.:
28873.37
Organism:
Homo sapiens (Human)
Description:
P00915
Residue:
261
  
Inhibitor
Name:
BDBM26989
Synonyms:
CHEMBL93268 nitrite | nitrite ion
Type:
Ion
Emp. Form.:
NO2
Mol. Mass.:
46.006
SMILES:
[O-]N=O
: