Target
Carbonic anhydrase 4
Ligand
BDBM26989
Substrate
Meas. Tech.
ChEMBL_302638 (CHEMBL839929)
Ki
30800000±n/a nM
Citation
 Innocenti, AFirnges, MAAntel, JWurl, MScozzafava, ASupuran, CT Carbonic anhydrase inhibitors: inhibition of the membrane-bound human isozyme IV with anions. Bioorg Med Chem Lett 14:5769-73 (2004)  
Target
Name:
Carbonic anhydrase 4
Synonyms:
CA-IV CAH4_HUMAN Carbonic anhydrase Carbonic anhydrase IV (CA IV)
Type:
Enzyme
Mol. Mass.:
35037.98
Organism:
Homo sapiens (Human)
Description:
P22748
Residue:
312
  
Inhibitor
Name:
BDBM26989
Synonyms:
CHEMBL93268 nitrite | nitrite ion
Type:
Ion
Emp. Form.:
NO2
Mol. Mass.:
46.006
SMILES:
[O-]N=O
: