Target
Gag-Pro polyprotein
Ligand
BDBM912
Substrate
Meas. Tech.
ChEMBL_303297 (CHEMBL827430)
Ki
14600±n/a nM
Citation
 Maegawa, HKimura, TArii, YMatsui, YKasai, SHayashi, YKiso, Y Identification of peptidomimetic HTLV-I protease inhibitors containing hydroxymethylcarbonyl (HMC) isostere as the transition-state mimic. Bioorg Med Chem Lett 14:5925-9 (2004)  
Target
Name:
Gag-Pro polyprotein
Synonyms:
Human T-cell leukemia virus type I protease gag-pro | prt
Type:
PROTEIN
Mol. Mass.:
71577.03
Organism:
Human T-cell leukemia virus 1 (strain Japan ATK-1 subtype A) (HTLV-1)
Description:
ChEMBL_303297
Residue:
651
  
Inhibitor
Name:
BDBM912
Synonyms:
(3S,4S)-3-hydroxy-4-[(2S)-2-[(3S,4S)-3-hydroxy-6-methyl-4-[(2S)-3-methyl-2-[(2S)-3-methyl-2-(3-methylbutanamido)butanamido]butanamido]heptanamido]propanamido]-6-methylheptanoic acid Iva-Val-Val-Sta-Ala-Sta-OH PEPSTATIN US9115083, Pepstatin
Type:
Small organic molecule
Emp. Form.:
C34H63N5O9
Mol. Mass.:
685.8921
SMILES:
CC(C)C[C@H](NC(=O)[C@H](C)NC(=O)C[C@H](O)[C@H](CC(C)C)NC(=O)[C@@H](NC(=O)[C@@H](NC(=O)CC(C)C)C(C)C)C(C)C)[C@@H](O)CC(O)=O
: