Target
RNA-directed RNA polymerase
Ligand
BDBM50157187
Substrate
Meas. Tech.
ChEMBL_306368 (CHEMBL829165)
IC50
>50000±n/a nM
Citation
 Shipps, GWDeng, YWang, TPopovici-Muller, JCurran, PJRosner, KECooper, ABGirijavallabhan, VButkiewicz, NCable, M Aminothiazole inhibitors of HCV RNA polymerase. Bioorg Med Chem Lett 15:115-9 (2004)  
Target
Name:
RNA-directed RNA polymerase
Synonyms:
Hepatitis C virus NS5B RNA-dependent RNA polymerase | NS5B protein
Type:
Protein
Mol. Mass.:
25173.95
Organism:
Hepatitis C virus
Description:
Q8JXU8
Residue:
229
  
Inhibitor
Name:
BDBM50157187
Synonyms:
2-(4-Phenoxy-benzoylamino)-thiazole-4-carboxylic acid | CHEMBL183651
Type:
Small organic molecule
Emp. Form.:
C17H12N2O4S
Mol. Mass.:
340.353
SMILES:
OC(=O)c1csc(NC(=O)c2ccc(Oc3ccccc3)cc2)n1
: