Target
Aminopeptidase N
Ligand
BDBM50157325
Substrate
Meas. Tech.
ChEMBL_305237 (CHEMBL876989)
IC50
3400±n/a nM
Citation
 Lee, JShim, JSJung, SALee, STKwon, HJ N-hydroxy-2-(naphthalene-2-ylsulfanyl)-acetamide, a novel hydroxamic acid-based inhibitor of aminopeptidase N and its anti-angiogenic activity. Bioorg Med Chem Lett 15:181-3 (2004)  
Target
Name:
Aminopeptidase N
Synonyms:
AMPN_HUMAN APN Aminopeptidase CD_antigen=CD13 Myeloid plasma membrane glycoprotein CD13 gp150 | hAPN
Type:
PROTEIN
Mol. Mass.:
109522.63
Organism:
Homo sapiens (Human)
Description:
ChEMBL_1507526
Residue:
967
  
Inhibitor
Name:
BDBM50157325
Synonyms:
CHEMBL182879 | N-Hydroxy-2-(naphthalen-2-ylsulfanyl)-acetamide
Type:
Small organic molecule
Emp. Form.:
C12H11NO2S
Mol. Mass.:
233.286
SMILES:
ONC(=O)CSc1ccc2ccccc2c1
: