Target
Somatostatin receptor type 2
Ligand
BDBM50169462
Substrate
Meas. Tech.
ChEMBL_302432 (CHEMBL827130)
Ki
1.8±n/a nM
Citation
 Contour-Galcéra, MOSidhu, APlas, PRoubert, P 3-Thio-1,2,4-triazoles, novel somatostatin sst2/sst5 agonists. Bioorg Med Chem Lett 15:3555-9 (2005)  
Target
Name:
Somatostatin receptor type 2
Synonyms:
SOMATOSTATIN SST2 SS-2-R SS2R SSTR2 | Somatostatin receptor type 2 (SSTR2)
Type:
Enzyme
Mol. Mass.:
41344.94
Organism:
Homo sapiens (Human)
Description:
P30874
Residue:
369
  
Inhibitor
Name:
BDBM50169462
Synonyms:
4-{3-[2-(7-Methyl-1H-indol-3-yl)-ethylsulfanyl]-5-quinolin-2-yl-[1,2,4]triazol-4-yl}-butylamine | CHEMBL187768
Type:
Small organic molecule
Emp. Form.:
C26H28N6S
Mol. Mass.:
456.606
SMILES:
Cc1cccc2c(CCSc3nnc(-c4ccc5ccccc5n4)n3CCCCN)c[nH]c12
: