Target
Somatostatin receptor type 5
Ligand
BDBM50169465
Substrate
Meas. Tech.
ChEMBL_302433 (CHEMBL827131)
Ki
0.380000±n/a nM
Citation
 Contour-Galcéra, MOSidhu, APlas, PRoubert, P 3-Thio-1,2,4-triazoles, novel somatostatin sst2/sst5 agonists. Bioorg Med Chem Lett 15:3555-9 (2005)  
Target
Name:
Somatostatin receptor type 5
Synonyms:
SOMATOSTATIN SST5 SS5-R SSR5_HUMAN Somatostatin receptor type 5 (SSTR5)
Type:
Enzyme
Mol. Mass.:
39218.02
Organism:
Homo sapiens (Human)
Description:
P35346
Residue:
364
  
Inhibitor
Name:
BDBM50169465
Synonyms:
3-[4-(4-Amino-butyl)-5-quinolin-2-yl-4H-[1,2,4]triazol-3-ylsulfanyl]-1-(7-methyl-1H-indol-3-yl)-propan-1-one | CHEMBL434159
Type:
Small organic molecule
Emp. Form.:
C27H28N6OS
Mol. Mass.:
484.616
SMILES:
Cc1cccc2c(c[nH]c12)C(=O)CCSc1nnc(-c2ccc3ccccc3n2)n1CCCCN
: