Target
Somatostatin receptor type 5
Ligand
BDBM50169463
Substrate
Meas. Tech.
ChEMBL_302433 (CHEMBL827131)
Ki
58±n/a nM
Citation
 Contour-Galcéra, MOSidhu, APlas, PRoubert, P 3-Thio-1,2,4-triazoles, novel somatostatin sst2/sst5 agonists. Bioorg Med Chem Lett 15:3555-9 (2005)  
Target
Name:
Somatostatin receptor type 5
Synonyms:
SOMATOSTATIN SST5 SS5-R SSR5_HUMAN Somatostatin receptor type 5 (SSTR5)
Type:
Enzyme
Mol. Mass.:
39218.02
Organism:
Homo sapiens (Human)
Description:
P35346
Residue:
364
  
Inhibitor
Name:
BDBM50169463
Synonyms:
4-{3-Benzo[b]thiophen-2-yl-5-[2-(1H-indol-3-yl)-ethylsulfanyl]-[1,2,4]triazol-4-yl}-butylamine | CHEMBL191171
Type:
Small organic molecule
Emp. Form.:
C24H25N5S2
Mol. Mass.:
447.619
SMILES:
NCCCCn1c(SCCc2c[nH]c3ccccc23)nnc1-c1cc2ccccc2s1
: