Target
Somatostatin receptor type 2
Ligand
BDBM50169475
Substrate
Meas. Tech.
ChEMBL_302432 (CHEMBL827130)
Ki
12±n/a nM
Citation
 Contour-Galcéra, MOSidhu, APlas, PRoubert, P 3-Thio-1,2,4-triazoles, novel somatostatin sst2/sst5 agonists. Bioorg Med Chem Lett 15:3555-9 (2005)  
Target
Name:
Somatostatin receptor type 2
Synonyms:
SOMATOSTATIN SST2 SS-2-R SS2R SSTR2 | Somatostatin receptor type 2 (SSTR2)
Type:
Enzyme
Mol. Mass.:
41344.94
Organism:
Homo sapiens (Human)
Description:
P30874
Residue:
369
  
Inhibitor
Name:
BDBM50169475
Synonyms:
4-{3-[2-(1H-Indol-3-yl)-ethylsulfanyl]-5-quinolin-2-yl-[1,2,4]triazol-4-yl}-butylamine | CHEMBL191025
Type:
Small organic molecule
Emp. Form.:
C25H26N6S
Mol. Mass.:
442.579
SMILES:
NCCCCn1c(SCCc2c[nH]c3ccccc23)nnc1-c1ccc2ccccc2n1
: