Target
Somatostatin receptor type 5
Ligand
BDBM50169476
Substrate
Meas. Tech.
ChEMBL_302433 (CHEMBL827131)
Ki
26±n/a nM
Citation
 Contour-Galcéra, MOSidhu, APlas, PRoubert, P 3-Thio-1,2,4-triazoles, novel somatostatin sst2/sst5 agonists. Bioorg Med Chem Lett 15:3555-9 (2005)  
Target
Name:
Somatostatin receptor type 5
Synonyms:
SOMATOSTATIN SST5 SS5-R SSR5_HUMAN Somatostatin receptor type 5 (SSTR5)
Type:
Enzyme
Mol. Mass.:
39218.02
Organism:
Homo sapiens (Human)
Description:
P35346
Residue:
364
  
Inhibitor
Name:
BDBM50169476
Synonyms:
4-{3-(4-Ethyl-phenyl)-5-[2-(1H-indol-3-yl)-ethylsulfanyl]-[1,2,4]triazol-4-yl}-butylamine | CHEMBL365627
Type:
Small organic molecule
Emp. Form.:
C24H29N5S
Mol. Mass.:
419.586
SMILES:
CCc1ccc(cc1)-c1nnc(SCCc2c[nH]c3ccccc23)n1CCCCN
: