Target
Somatostatin receptor type 1
Ligand
BDBM50169468
Substrate
Meas. Tech.
ChEMBL_302376 (CHEMBL830344)
Ki
58±n/a nM
Citation
 Contour-Galcéra, MOSidhu, APlas, PRoubert, P 3-Thio-1,2,4-triazoles, novel somatostatin sst2/sst5 agonists. Bioorg Med Chem Lett 15:3555-9 (2005)  
Target
Name:
Somatostatin receptor type 1
Synonyms:
SOMATOSTATIN SST1 SS-1-R SS1R SSTR1 | Somatostatin receptor type 1 (SSTR1)
Type:
Enzyme
Mol. Mass.:
42692.81
Organism:
Homo sapiens (Human)
Description:
P30872
Residue:
391
  
Inhibitor
Name:
BDBM50169468
Synonyms:
4-{3-[2-(6-Fluoro-1H-indol-3-yl)-ethylsulfanyl]-5-quinolin-2-yl-[1,2,4]triazol-4-yl}-butylamine | CHEMBL363092
Type:
Small organic molecule
Emp. Form.:
C25H25FN6S
Mol. Mass.:
460.57
SMILES:
NCCCCn1c(SCCc2c[nH]c3cc(F)ccc23)nnc1-c1ccc2ccccc2n1
: