Target
Kappa-type opioid receptor
Ligand
BDBM50169776
Substrate
Meas. Tech.
ChEMBL_302641 (CHEMBL876690)
Ki
>1000±n/a nM
Citation
 Lee, DYKarnati, VVHe, MLiu-Chen, LYKondaveti, LMa, ZWang, YChen, YBeguin, CCarlezon, WACohen, B Synthesis and in vitro pharmacological studies of new C(2) modified salvinorin A analogues. Bioorg Med Chem Lett 15:3744-7 (2005)  
Target
Name:
Kappa-type opioid receptor
Synonyms:
K-OR-1 Kappa-opioid receptor (KOR) Kappa-type opioid receptor (KOR) OPIATE Kappa OPRK1 kappa opioid receptor (KOR)
Type:
G Protein-Coupled Receptor (GPCR)
Mol. Mass.:
42648.76
Organism:
Homo sapiens (Human)
Description:
P41145
Residue:
380
  
Inhibitor
Name:
BDBM50169776
Synonyms:
(3S,4aS,8aR,10aR)-3-Furan-3-yl-4a,8a-dimethyl-1,6-dioxo-3,4,4a,6,8a,9,10,10a-octahydro-1H-2-oxa-phenanthrene-8-carboxylic acid methyl ester | CHEMBL178275
Type:
Small organic molecule
Emp. Form.:
C21H22O6
Mol. Mass.:
370.3958
SMILES:
COC(=O)C1=CC(=O)C=C2[C@@]3(C)C[C@H](OC(=O)[C@@H]3CC[C@@]12C)c1ccoc1
: