Target
Kappa-type opioid receptor
Ligand
BDBM50169775
Substrate
Meas. Tech.
ChEMBL_302641 (CHEMBL876690)
Ki
43.0±n/a nM
Citation
 Lee, DYKarnati, VVHe, MLiu-Chen, LYKondaveti, LMa, ZWang, YChen, YBeguin, CCarlezon, WACohen, B Synthesis and in vitro pharmacological studies of new C(2) modified salvinorin A analogues. Bioorg Med Chem Lett 15:3744-7 (2005)  
Target
Name:
Kappa-type opioid receptor
Synonyms:
K-OR-1 Kappa-opioid receptor (KOR) Kappa-type opioid receptor (KOR) OPIATE Kappa OPRK1 kappa opioid receptor (KOR)
Type:
G Protein-Coupled Receptor (GPCR)
Mol. Mass.:
42648.76
Organism:
Homo sapiens (Human)
Description:
P41145
Residue:
380
  
Inhibitor
Name:
BDBM50169775
Synonyms:
(3S,4aR,6S,8R,8aR,10aR)-3-Furan-3-yl-6-hydroxy-4a,8a-dimethyl-1,5-dioxo-dodecahydro-2-oxa-phenanthrene-8-carboxylic acid methyl ester | CHEMBL178129
Type:
Small organic molecule
Emp. Form.:
C21H26O7
Mol. Mass.:
390.4269
SMILES:
COC(=O)[C@@H]1C[C@H](O)C(=O)C2[C@@]1(C)CC[C@H]1C(=O)O[C@@H](C[C@]21C)c1ccoc1
: