Target
Carbonic anhydrase 2
Ligand
BDBM50171021
Substrate
Meas. Tech.
ChEMBL_302944 (CHEMBL841779)
Ki
33±n/a nM
Citation
 Mincione, FStarnotti, MMasini, EBacciottini, LScrivanti, CCasini, AVullo, DScozzafava, ASupuran, CT Carbonic anhydrase inhibitors: design of thioureido sulfonamides with potent isozyme II and XII inhibitory properties and intraocular pressure lowering activity in a rabbit model of glaucoma. Bioorg Med Chem Lett 15:3821-7 (2005)  
Target
Name:
Carbonic anhydrase 2
Synonyms:
CA-II CAC Carbonate dehydratase II Carbonic anhydrase 2 (CA-II) Carbonic anhydrase C Carbonic anhydrase II (CA-II) Carbonic anhydrase II (hCA II) | Carbonic anhydrase isoenzyme II (hCA II)
Type:
Enzyme
Mol. Mass.:
29250.71
Organism:
Homo sapiens (Human)
Description:
P00918
Residue:
260
  
Inhibitor
Name:
BDBM50171021
Synonyms:
4-[3-(2-Dimethylamino-ethyl)-thioureido]-benzenesulfonamide | CHEMBL179218
Type:
Small organic molecule
Emp. Form.:
C11H18N4O2S2
Mol. Mass.:
302.416
SMILES:
CN(C)CCNC(=S)Nc1ccc(cc1)S(N)(=O)=O
: