Target
Carboxylic ester hydrolase
Ligand
BDBM50169854
Substrate
Meas. Tech.
ChEMBL_305980 (CHEMBL832145)
IC50
393000±n/a nM
Citation
 Sheng, RLin, XLi, JJiang, YShang, ZHu, Y Design, synthesis, and evaluation of 2-phenoxy-indan-1-one derivatives as acetylcholinesterase inhibitors. Bioorg Med Chem Lett 15:3834-7 (2005)  
Target
Name:
Carboxylic ester hydrolase
Synonyms:
Acetylcholinesterase and butyrylcholinesterase (AChE and BChE) Butyrylcholinesterase (BuChE) | butyrylcholinesterase precursor
Type:
Enzyme
Mol. Mass.:
67776.22
Organism:
Rattus norvegicus (rat)
Description:
Residue:
597
  
Inhibitor
Name:
BDBM50169854
Synonyms:
5,6-Dimethoxy-2-{4-[1-(4-methyl-piperazin-1-yl)-ethyl]-phenoxy}-indan-1-one | CHEMBL361540
Type:
Small organic molecule
Emp. Form.:
C24H30N2O4
Mol. Mass.:
410.506
SMILES:
COc1cc2CC(Oc3ccc(cc3)C(C)N3CCN(C)CC3)C(=O)c2cc1OC
: