Target
Alpha-2A adrenergic receptor
Ligand
BDBM50170183
Substrate
Meas. Tech.
ChEMBL_306231 (CHEMBL831139)
IC50
60±n/a nM
Citation
 Kanuma, KOmodera, KNishiguchi, MFunakoshi, TChaki, SSemple, GTran, TAKramer, BHsu, DCasper, MThomsen, BSekiguchi, Y Lead optimization of 4-(dimethylamino)quinazolines, potent and selective antagonists for the melanin-concentrating hormone receptor 1. Bioorg Med Chem Lett 15:3853-6 (2005)  
Target
Name:
Alpha-2A adrenergic receptor
Synonyms:
ADA2A_HUMAN ADRA2R Adrenergic alpha2A Alpha-2 adrenergic receptor subtype C10 Alpha-2A adrenoreceptor alpha-2A adrenergic receptor [Homo sapiens]
Type:
Enzyme
Mol. Mass.:
48979.91
Organism:
Homo sapiens (Human)
Description:
P08913
Residue:
465
  
Inhibitor
Name:
BDBM50170183
Synonyms:
CHEMBL181632 | N-[4-(4-Dimethylamino-quinazolin-2-ylamino)-cyclohexyl]-3-trifluoromethyl-benzamide
Type:
Small organic molecule
Emp. Form.:
C24H26F3N5O
Mol. Mass.:
457.4913
SMILES:
CN(C)c1nc(N[C@@H]2CC[C@@H](CC2)NC(=O)c2cccc(c2)C(F)(F)F)nc2ccccc12
: