Target
Alpha-2A adrenergic receptor
Ligand
BDBM50170187
Substrate
Meas. Tech.
ChEMBL_306231 (CHEMBL831139)
IC50
34±n/a nM
Citation
 Kanuma, KOmodera, KNishiguchi, MFunakoshi, TChaki, SSemple, GTran, TAKramer, BHsu, DCasper, MThomsen, BSekiguchi, Y Lead optimization of 4-(dimethylamino)quinazolines, potent and selective antagonists for the melanin-concentrating hormone receptor 1. Bioorg Med Chem Lett 15:3853-6 (2005)  
Target
Name:
Alpha-2A adrenergic receptor
Synonyms:
ADA2A_HUMAN ADRA2R Adrenergic alpha2A Alpha-2 adrenergic receptor subtype C10 Alpha-2A adrenoreceptor alpha-2A adrenergic receptor [Homo sapiens]
Type:
Enzyme
Mol. Mass.:
48979.91
Organism:
Homo sapiens (Human)
Description:
P08913
Residue:
465
  
Inhibitor
Name:
BDBM50170187
Synonyms:
CHEMBL181727 | trans-4-Bromo-N-{4-[(4-dimethylamino-quinazolin-2-ylamino)-methyl]-cyclohexylmethyl}-N-methyl-2-trifluoromethoxy-benzenesulfonamide
Type:
Small organic molecule
Emp. Form.:
C26H31BrF3N5O3S
Mol. Mass.:
630.52
SMILES:
CN(C)c1nc(NCC2CCC(CN(C)S(=O)(=O)c3ccc(Br)cc3OC(F)(F)F)CC2)nc2ccccc12
: