Target
Carbonic anhydrase 2
Ligand
BDBM50157949
Substrate
Meas. Tech.
ChEMBL_303334 (CHEMBL840150)
Ki
1.6±n/a nM
Citation
 Turkmen, HDurgun, MYilmaztekin, SEmul, MInnocenti, AVullo, DScozzafava, ASupuran, CT Carbonic anhydrase inhibitors. Novel sulfanilamide/acetazolamide derivatives obtained by the tail approach and their interaction with the cytosolic isozymes I and II, and the tumor-associated isozyme IX. Bioorg Med Chem Lett 15:367-72 (2004)  
Target
Name:
Carbonic anhydrase 2
Synonyms:
CA-II CAC Carbonate dehydratase II Carbonic anhydrase 2 (CA-II) Carbonic anhydrase C Carbonic anhydrase II (CA-II) Carbonic anhydrase II (hCA II) | Carbonic anhydrase isoenzyme II (hCA II)
Type:
Enzyme
Mol. Mass.:
29250.71
Organism:
Homo sapiens (Human)
Description:
P00918
Residue:
260
  
Inhibitor
Name:
BDBM50157949
Synonyms:
2-(4-Methyl-piperazin-1-yl)-N-(5-sulfamoyl-[1,3,4]thiadiazol-2-yl)-acetamide CHEMBL179897
Type:
Small organic molecule
Emp. Form.:
C9H16N6O3S2
Mol. Mass.:
320.392
SMILES:
CN1CCN(CC(=O)Nc2nnc(s2)S(N)(=O)=O)CC1
: