Target
Carbonic anhydrase 1
Ligand
BDBM50159801
Substrate
Meas. Tech.
ChEMBL_302714 (CHEMBL839585)
Ki
548±n/a nM
Citation
 Winum, JYPastorekova, SJakubickova, LMontero, JLScozzafava, APastorek, JVullo, DInnocenti, ASupuran, CT Carbonic anhydrase inhibitors: synthesis and inhibition of cytosolic/tumor-associated carbonic anhydrase isozymes I, II, and IX with bis-sulfamates. Bioorg Med Chem Lett 15:579-84 (2005)  
Target
Name:
Carbonic anhydrase 1
Synonyms:
CA-I CAB Carbonate dehydratase I Carbonic anhydrase 1 (CA I) Carbonic anhydrase 1 (Recombinant CA I) Carbonic anhydrase B Carbonic anhydrase I (CA I) Carbonic anhydrase I (CAI) Carbonic anhydrase isoenzyme I (hCA I) | hCA
Type:
Enzyme
Mol. Mass.:
28873.37
Organism:
Homo sapiens (Human)
Description:
P00915
Residue:
261
  
Inhibitor
Name:
BDBM50159801
Synonyms:
CHEMBL353258 | Sulfamic acid 4-sulfamoyloxy-butyl ester
Type:
Small organic molecule
Emp. Form.:
C4H12N2O6S2
Mol. Mass.:
248.278
SMILES:
NS(=O)(=O)OCCCCOS(N)(=O)=O
: