Target
Mu-type opioid receptor
Ligand
BDBM50165049
Substrate
Meas. Tech.
ChEMBL_303068 (CHEMBL828894)
Ki
0.052000±n/a nM
Citation
 Wentland, MPLu, QLou, RBu, YKnapp, BIBidlack, JM Synthesis and opioid receptor binding properties of a highly potent 4-hydroxy analogue of naltrexone. Bioorg Med Chem Lett 15:2107-10 (2005)  
Target
Name:
Mu-type opioid receptor
Synonyms:
M-OR-1 MOR-1 MUOR1 Mu opiate receptor OPRM1 hMOP | mu-type opioid receptor isoform MOR-1
Type:
G Protein-Coupled Receptor (GPCR)
Mol. Mass.:
44789.51
Organism:
Homo sapiens (Human)
Description:
P35372
Residue:
400
  
Inhibitor
Name:
BDBM50165049
Synonyms:
17-cyclopropylmethyl-3,10-dihydroxy-13-oxo-(1R,9R,10S)-17-azatetracyclo[7.5.3.01,10.02,7]heptadeca-2(7),3,5-triene-4-carboxamide | CHEMBL426084
Type:
Small organic molecule
Emp. Form.:
C21H26N2O4
Mol. Mass.:
370.4421
SMILES:
NC(=O)c1ccc2C[C@H]3N(CC4CC4)CC[C@@]4(CC(=O)CC[C@@]34O)c2c1O
: