Target
Steryl-sulfatase
Ligand
BDBM50151141
Substrate
Meas. Tech.
ChEMBL_302762 (CHEMBL838826)
Ki
32000±n/a nM
Citation
 Horvath, ANussbaumer, PWolff, BBillich, A 2-(1-adamantyl)-4-(thio)chromenone-6-carboxylic acids: potent reversible inhibitors of human steroid sulfatase. J Med Chem 47:4268-76 (2004)  
Target
Name:
Steryl-sulfatase
Synonyms:
ARSC1 Arylsulfatase C STS_HUMAN Steryl-sulfate sulfohydrolase
Type:
Enzyme
Mol. Mass.:
65503.66
Organism:
Homo sapiens (Human)
Description:
P08842
Residue:
583
  
Inhibitor
Name:
BDBM50151141
Synonyms:
2-Adamantan-1-yl-6-hydroxymethyl-chromen-4-one | CHEMBL364624
Type:
Small organic molecule
Emp. Form.:
C20H22O3
Mol. Mass.:
310.3869
SMILES:
OCc1ccc2oc(cc(=O)c2c1)C12CC3CC(CC(C3)C1)C2
: