Target
Steryl-sulfatase
Ligand
BDBM50151140
Substrate
Meas. Tech.
ChEMBL_302762 (CHEMBL838826)
Ki
3200±n/a nM
Citation
 Horvath, ANussbaumer, PWolff, BBillich, A 2-(1-adamantyl)-4-(thio)chromenone-6-carboxylic acids: potent reversible inhibitors of human steroid sulfatase. J Med Chem 47:4268-76 (2004)  
Target
Name:
Steryl-sulfatase
Synonyms:
ARSC1 Arylsulfatase C STS_HUMAN Steryl-sulfate sulfohydrolase
Type:
Enzyme
Mol. Mass.:
65503.66
Organism:
Homo sapiens (Human)
Description:
P08842
Residue:
583
  
Inhibitor
Name:
BDBM50151140
Synonyms:
2-Adamantan-1-yl-6-(2-hydroxy-acetyl)-chromen-4-one | CHEMBL188128
Type:
Small organic molecule
Emp. Form.:
C21H22O4
Mol. Mass.:
338.397
SMILES:
OCC(=O)c1ccc2oc(cc(=O)c2c1)C12CC3CC(CC(C3)C1)C2
: