Target
P2Y purinoceptor 1
Ligand
BDBM50370496
Substrate
Meas. Tech.
ChEMBL_310399 (CHEMBL833177)
EC50
4.50±n/a nM
Citation
 Major, DTNahum, VWang, YReiser, GFischer, B Molecular recognition in purinergic receptors. 2. Diastereoselectivity of the h-P2Y1-receptor. J Med Chem 47:4405-16 (2004)  
Target
Name:
P2Y purinoceptor 1
Synonyms:
ATP receptor P2Y1 Purinergic receptor | Purinergic receptor P2Y1
Type:
PROTEIN
Mol. Mass.:
42338.46
Organism:
Rattus norvegicus
Description:
ChEMBL_873671
Residue:
373
  
Inhibitor
Name:
BDBM50370496
Synonyms:
CHEMBL610595
Type:
Small organic molecule
Emp. Form.:
C10H18BClN5O12P3
Mol. Mass.:
539.462
SMILES:
BP(O)(OC[C@H]1OC([C@H](O)[C@@H]1O)n1cnc2c(N)nc(Cl)nc12)OP(O)(=O)OP(O)(O)=O
: