Target
Gastrin/cholecystokinin type B receptor
Ligand
BDBM50154437
Substrate
Meas. Tech.
ChEMBL_310796 (CHEMBL835642)
EC50
1.5±n/a nM
Citation
 Muñoz-Ruiz, PGarcía-López, MTCenarruzabeitia, EDel Río, JDufresne, MFoucaud, MFourmy, DHerranz, R 5-(tryptophylamino)-1,3-dioxoperhydropyrido[1,2-c]pyrimidine-based cholecystokinin receptor antagonists: reversal of CCK1 receptor subtype selectivity toward CCK2 receptors. J Med Chem 47:5318-29 (2004)  
Target
Name:
Gastrin/cholecystokinin type B receptor
Synonyms:
CCK-2 receptor CCK-BR CCKRB Cholecystokinin receptor GASR_HUMAN | Gastrin/cholecystokinin type B receptor
Type:
G Protein-Coupled Receptor (GPCR)
Mol. Mass.:
48445.79
Organism:
Homo sapiens (Human)
Description:
Stable expression of human CCK-2 receptors in HEK 293 cells.
Residue:
447
  
Inhibitor
Name:
BDBM50154437
Synonyms:
CHEMBL414345 | Cholecystokinin-9
Type:
Small organic molecule
Emp. Form.:
C55H74N14O17S3
Mol. Mass.:
1299.455
SMILES:
CSCC[C@H](NC(=O)[C@H](Cc1ccc(OS(O)(=O)=O)cc1)NC(=O)[C@H](CC(O)=O)NC(=O)[C@@H](N)CCCNC(N)=N)C(=O)NCC(=O)N[C@@H](Cc1c[nH]c2ccccc12)C(=O)N[C@@H](CCSC)C(=O)N[C@@H](CC(O)=O)C(=O)N[C@@H](Cc1ccccc1)C(N)=O
: