Target
Acetylcholinesterase
Ligand
BDBM50039733
Substrate
Meas. Tech.
ChEMBL_305174 (CHEMBL832763)
IC50
220±n/a nM
Citation
 Guo, JHurley, MMWright, JBLushington, GH A docking score function for estimating ligand-protein interactions: application to acetylcholinesterase inhibition. J Med Chem 47:5492-500 (2004)  
Target
Name:
Acetylcholinesterase
Synonyms:
ACES_HUMAN Acetylcholinesterase (AChE) | Acetylcholinesterase (human AChE)
Type:
Enzyme
Mol. Mass.:
67792.70
Organism:
Homo sapiens (Human)
Description:
P22303
Residue:
614
  
Inhibitor
Name:
BDBM50039733
Synonyms:
1-(2-(1-benzylpiperidin-4-yl)ethyl)isoquinoline CHEMBL92142
Type:
Small organic molecule
Emp. Form.:
C23H26N2
Mol. Mass.:
330.4659
SMILES:
C(Cc1nccc2ccccc12)C1CCN(Cc2ccccc2)CC1
: