Target
Sodium-dependent dopamine transporter
Ligand
BDBM50156055
Substrate
Meas. Tech.
ChEMBL_303689 (CHEMBL829734)
Ki
3800±n/a nM
Citation
 Zhou, JHe, RJohnson, KMYe, YKozikowski, AP Piperidine-based nocaine/modafinil hybrid ligands as highly potent monoamine transporter inhibitors: efficient drug discovery by rational lead hybridization. J Med Chem 47:5821-4 (2004)  
Target
Name:
Sodium-dependent dopamine transporter
Synonyms:
DA transporter SC6A3_RAT Sodium-dependent dopamine transporter | Sodium-dependent dopamine transporter (DAT)
Type:
Multi-pass membrane protein
Mol. Mass.:
68749.45
Organism:
Rattus norvegicus (rat)
Description:
P23977
Residue:
619
  
Inhibitor
Name:
BDBM50156055
Synonyms:
2-(Diphenyl-methanesulfinyl)-acetamide 2-[(diphenylmethyl)sulfinyl]acetamide CEP-1538 CRL-40476 Provigil US11555013, Compound (+-)-modafinilb | US9862679, Compound (+-)-modafinil
Type:
Small organic molecule
Emp. Form.:
C15H15NO2S
Mol. Mass.:
273.35
SMILES:
NC(=O)CS(=O)C(c1ccccc1)c1ccccc1
: